Target
Prostaglandin G/H synthase 2
Ligand
BDBM50035936
Substrate
Meas. Tech.
ChEMBL_1436537 (CHEMBL3382316)
IC50
10660±n/a nM
Citation
 Alegaon, SGHirpara, MBAlagawadi, KRHullatti, KKKashniyal, K Synthesis of novel pyrazole?thiadiazole hybrid as potential potent and selective cyclooxygenase-2 (COX-2) inhibitors. Bioorg Med Chem Lett 24:5324-9 (2015)  
Target
Name:
Prostaglandin G/H synthase 2
Synonyms:
COX2 Cyclooxygenase-2 (COX-2) PTGS2 Prostaglandin G/H synthase (cyclooxygenase)
Type:
Protein
Mol. Mass.:
68976.98
Organism:
Ovis aries (Sheep)
Description:
Residue:
603
  
Inhibitor
Name:
BDBM50035936
Synonyms:
CHEMBL3338723
Type:
Small organic molecule
Emp. Form.:
C19H14ClN5OS
Mol. Mass.:
395.865
SMILES:
Clc1ccc(cc1)-c1nn(cc1\C=N/NC1=NC(=O)CS1)-c1ccccc1
: