Target
Histone deacetylase 6
Ligand
BDBM50005711
Substrate
Meas. Tech.
ChEMBL_1434458 (CHEMBL3388275)
IC50
8.2±n/a nM
Citation
 Zwick, VChatzivasileiou, AODeschamps, NRoussaki, MSimões-Pires, CANurisso, ADenis, IBlanquart, CMartinet, NCarrupt, PADetsi, ACuendet, M Aurones as histone deacetylase inhibitors: identification of key features. Bioorg Med Chem Lett 24:5497-501 (2015)  
Target
Name:
Histone deacetylase 6
Synonyms:
Cereblon/Histone deacetylase 6 HDAC6 Histone deacetylase 6 (HDAC6) KIAA0901 | ORF Names:JM21
Type:
Chromatin regulator; hydrolase; repressor
Mol. Mass.:
131381.51
Organism:
Homo sapiens (Human)
Description:
Q9UBN7
Residue:
1215
  
Inhibitor
Name:
BDBM50005711
Synonyms:
CHEBI:46024 TRICHOSTATIN Trichostatin A (TSA) US10722597, Compound Trichostatin US20230322747, Compound trichostatin A | US9265734, TSA
Type:
Small organic molecule
Emp. Form.:
C17H22N2O3
Mol. Mass.:
302.3682
SMILES:
C[C@H](\C=C(/C)\C=C\C(=O)NO)C(=O)c1ccc(cc1)N(C)C
: