Target
Cell cycle checkpoint protein RAD1
Ligand
BDBM50424495
Substrate
Meas. Tech.
ChEMBL_1446559 (CHEMBL3377958)
EC50
44000±n/a nM
Citation
 Huang, FMazin, AV Targeting the homologous recombination pathway by small molecule modulators. Bioorg Med Chem Lett 24:3006-13 (2014)  
Target
Name:
Cell cycle checkpoint protein RAD1
Synonyms:
Cell cycle checkpoint protein RAD1 RAD1 REC1 hRAD1
Type:
PROTEIN
Mol. Mass.:
31814.86
Organism:
Homo sapiens (Human)
Description:
ChEMBL_109445
Residue:
282
  
Inhibitor
Name:
BDBM50424495
Synonyms:
CHEMBL2316726
Type:
Small organic molecule
Emp. Form.:
C21H18Cl2N2O4
Mol. Mass.:
433.285
SMILES:
COc1ccc(cc1)C1=C(N2CCOCC2)C(=O)N(C1=O)c1ccc(Cl)c(Cl)c1
: