Target
C-C chemokine receptor type 4
Ligand
BDBM50380884
Substrate
Meas. Tech.
ChEMBL_1458079 (CHEMBL3367642)
IC50
3.9±n/a nM
Citation
 Miah, AHAbas, HBegg, MMarsh, BJO'Flynn, DEFord, AJPercy, JMProcopiou, PARichards, SARumley, SA Lead identification of benzimidazolone and azabenzimidazolone arylsulfonamides as CC-chemokine receptor 4 (CCR4) antagonists. Bioorg Med Chem 22:4298-311 (2014)  
Target
Name:
C-C chemokine receptor type 4
Synonyms:
C-C CKR-4 C-C chemokine receptor type 4 (CCR4) CCR-4 CCR4_HUMAN CMKBR4 | K5-5
Type:
Enzyme
Mol. Mass.:
41406.41
Organism:
Homo sapiens (Human)
Description:
P51679
Residue:
360
  
Inhibitor
Name:
BDBM50380884
Synonyms:
CHEMBL2018954
Type:
Small organic molecule
Emp. Form.:
C23H27BrN4O5S
Mol. Mass.:
551.453
SMILES:
COc1ccc(COc2nc(Br)cnc2NS(=O)(=O)c2ccc(C)cc2)cc1OCCN(C)C
: