Target
KiSS-1 receptor
Ligand
BDBM50045509
Substrate
Meas. Tech.
ChEMBL_1448385 (CHEMBL3376869)
Ki
0.034000±n/a nM
Citation
 Asami, TNishizawa, NMatsui, HTakatsu, YSuzuki, AKiba, ATerada, MNishibori, KNakayama, MBan, JMatsumoto, STarui, NIkeda, YYamaguchi, MKusaka, MOhtaki, TKitada, C Physicochemically and pharmacokinetically stable nonapeptide KISS1 receptor agonists with highly potent testosterone-suppressive activity. J Med Chem 57:6105-15 (2014)  
Target
Name:
KiSS-1 receptor
Synonyms:
AXOR12 G-protein coupled receptor 54 (GPR54) Hypogonadotropin-1 KISSR_HUMAN Kisspeptins receptor hOT7T175
Type:
G Protein-Coupled Receptor (GPCR)
Mol. Mass.:
42613.79
Organism:
Homo sapiens (Human)
Description:
Binding assay was performed using membranes from the CHO cell transfectants.
Residue:
398
  
Inhibitor
Name:
BDBM50045509
Synonyms:
CHEMBL3314226
Type:
Small organic molecule
Emp. Form.:
C66H85N17O13
Mol. Mass.:
1324.4872
SMILES:
CNC(=N)NCCC[C@H](NC(=O)[C@H](CC(C)C)NC(=O)NNC(=O)[C@H](Cc1ccccc1)NC(=O)[C@@H](NC(=O)[C@H](CC(N)=O)NC(=O)[C@@H](Cc1c[nH]c2ccccc12)NC(=O)[C@@H](Cc1ccc(O)cc1)NC(=O)C1CC1)[C@@H](C)O)C(=O)N[C@@H](Cc1c[nH]c2ccccc12)C(N)=O
: