Target
KiSS-1 receptor
Ligand
BDBM50045513
Substrate
Meas. Tech.
ChEMBL_1448386 (CHEMBL3376870)
Ki
0.088000±n/a nM
Citation
 Asami, TNishizawa, NMatsui, HTakatsu, YSuzuki, AKiba, ATerada, MNishibori, KNakayama, MBan, JMatsumoto, STarui, NIkeda, YYamaguchi, MKusaka, MOhtaki, TKitada, C Physicochemically and pharmacokinetically stable nonapeptide KISS1 receptor agonists with highly potent testosterone-suppressive activity. J Med Chem 57:6105-15 (2014)  
Target
Name:
KiSS-1 receptor
Synonyms:
Gpr54 Kiss1r
Type:
PROTEIN
Mol. Mass.:
42915.37
Organism:
Rattus norvegicus
Description:
ChEMBL_1448383
Residue:
396
  
Inhibitor
Name:
BDBM50045513
Synonyms:
Kisspeptin-10
Type:
Small organic molecule
Emp. Form.:
C63H83N17O14
Mol. Mass.:
1302.4386
SMILES:
CC(C)C[C@H](NC(=O)CNC(=O)[C@H](Cc1ccccc1)NC(=O)[C@H](CO)NC(=O)[C@H](CC(N)=O)NC(=O)[C@H](Cc1c[nH]c2ccccc12)NC(=O)[C@H](CC(N)=O)NC(=O)[C@@H](N)Cc1ccc(O)cc1)C(=O)N[C@@H](CCCNC(N)=N)C(=O)N[C@@H](Cc1ccccc1)C(N)=O
: