Target
UDP-N-acetylmuramoylalanine--D-glutamate ligase
Ligand
BDBM50046818
Substrate
Meas. Tech.
ChEMBL_1452807 (CHEMBL3365478)
Ki
39000±n/a nM
Citation
 Perdih, AHrast, MBarreteau, HGobec, SWolber, GSolmajer, T Benzene-1,3-dicarboxylic acid 2,5-dimethylpyrrole derivatives as multiple inhibitors of bacterial Mur ligases (MurC-MurF). Bioorg Med Chem 22:4124-34 (2014)  
Target
Name:
UDP-N-acetylmuramoylalanine--D-glutamate ligase
Synonyms:
D-glutamic acid-adding enzyme MurD (E. coli) UDP-N-acetylmuramoyl-L-alanyl-D-glutamate synthetase | murD
Type:
Ligase
Mol. Mass.:
46963.02
Organism:
Escherichia coli (strain K12)
Description:
Residue:
438
  
Inhibitor
Name:
BDBM50046818
Synonyms:
CHEMBL3310464
Type:
Small organic molecule
Emp. Form.:
C24H18ClN3O5S
Mol. Mass.:
495.935
SMILES:
Cc1cc(\C=C2\S\C(NC2=O)=N\c2ccc(Cl)cc2)c(C)n1-c1cc(cc(c1)C(O)=O)C(O)=O
: