Target
Glutamate carboxypeptidase 2
Ligand
BDBM50046830
Substrate
Meas. Tech.
ChEMBL_1453676 (CHEMBL3363782)
Ki
3.9±n/a nM
Citation
 Tykvart, JSchimer, JBarinková, JPachl, PPo?tová-Slavetínská, LMajer, PKonvalinka, J?ácha, P Rational design of urea-based glutamate carboxypeptidase II (GCPII) inhibitors as versatile tools for specific drug targeting and delivery. Bioorg Med Chem 22:4099-108 (2014)  
Target
Name:
Glutamate carboxypeptidase 2
Synonyms:
FGCP FOLH1 Folate hydrolase 1 Glutamate carboxypeptidase 2 Membrane glutamate carboxypeptidase NAALAD1 PSM Prostate-specific membrane antigen mGCP
Type:
PROTEIN
Mol. Mass.:
84333.66
Organism:
Homo sapiens (Human)
Description:
ChEMBL_1497035
Residue:
750
  
Inhibitor
Name:
BDBM50046830
Synonyms:
CHEMBL3309681
Type:
Small organic molecule
Emp. Form.:
C58H97BrN8O24S
Mol. Mass.:
1402.399
SMILES:
[H][C@]12CS[C@@H](CCCCC(=O)NCCOCCOCCOCCOCCOCCOCCOCCOCCOCCOCCOCCOCCC(=O)NCCOc3cc(Br)ccc3NC(=O)NCCCC[C@H](NC(=O)N[C@@H](CCC(O)=O)C(O)=O)C(O)=O)[C@@]1([H])NC(=O)N2
: