Target
DNA gyrase subunit B
Ligand
BDBM50358854
Substrate
Meas. Tech.
ChEMBL_1454592 (CHEMBL3366704)
IC50
<10.0±n/a nM
Citation
 Basarab, GSHill, PJGarner, CEHull, KGreen, OSherer, BADangel, PBManchester, JIBist, SHauck, SZhou, FUria-Nickelsen, MIllingworth, RAlm, RRooney, MEakin, AE Optimization of pyrrolamide topoisomerase II inhibitors toward identification of an antibacterial clinical candidate (AZD5099). J Med Chem 57:6060-82 (2014)  
Target
Name:
DNA gyrase subunit B
Synonyms:
DNA gyrase DNA gyrase subunit B (gyrB) gyrB
Type:
Enzyme Subunit
Mol. Mass.:
72530.91
Organism:
Staphylococcus aureus
Description:
Residue:
644
  
Inhibitor
Name:
BDBM50358854
Synonyms:
CHEMBL1923440
Type:
Small organic molecule
Emp. Form.:
C15H15Cl2FN4O3S
Mol. Mass.:
421.274
SMILES:
Cc1[nH]c(C(=O)N[C@@H]2CCN(C[C@@H]2F)c2ncc(s2)C(O)=O)c(Cl)c1Cl
: