Target
Tyrosine-protein phosphatase non-receptor type 11
Ligand
BDBM50054271
Substrate
Meas. Tech.
ChEMBL_1458320 (CHEMBL3369282)
IC50
10700±n/a nM
Citation
 Zeng, LFZhang, RYYu, ZHLi, SWu, LGunawan, AMLane, BSMali, RSLi, XChan, RJKapur, RWells, CDZhang, ZY Therapeutic potential of targeting the oncogenic SHP2 phosphatase. J Med Chem 57:6594-609 (2014)  
Target
Name:
Tyrosine-protein phosphatase non-receptor type 11
Synonyms:
3.1.3.48 PTP-1D PTP2C Protein Tyrosine Phosphatase PPN11/Shp2 Protein-Tyrosine Phosphatase SHP-2 Protein-tyrosine phosphatase 2C SH-PTP3 SHP2 Src homology phosphatase 2 (SHP-2) Tyrosine-protein phosphatase non-receptor type 11 (SHP-2) | Tyrosine-protein phosphatase non-receptor type 11 (SHP2)
Type:
Protein phosphatase
Mol. Mass.:
68443.59
Organism:
Homo sapiens (Human)
Description:
Q06124
Residue:
593
  
Inhibitor
Name:
BDBM50054271
Synonyms:
CHEMBL3319390 | US9522881, 11c-8 (L88N25)
Type:
Small organic molecule
Emp. Form.:
C29H28IN3O5
Mol. Mass.:
625.4542
SMILES:
CC(C)c1ccc(NC(=O)CCC(=O)Nc2cccc(c2)-c2c(I)c3cc(C(O)=O)c(O)cc3n2C)cc1
: