Target
5-hydroxytryptamine receptor 7
Ligand
BDBM50055521
Substrate
Meas. Tech.
ChEMBL_1452242 (CHEMBL3366154)
Ki
97±n/a nM
Citation
 Sampson, DBricker, BZhu, XYPeprah, KLamango, NSSetola, VRoth, BLAblordeppey, SY Further evaluation of the tropane analogs of haloperidol. Bioorg Med Chem Lett 24:4294-7 (2014)  
Target
Name:
5-hydroxytryptamine receptor 7
Synonyms:
5-HT-7 5-HT7 5-HT7S 5HT7 HTR7 | Serotonin receptor 7
Type:
G Protein-Coupled Receptor (GPCR)
Mol. Mass.:
53573.08
Organism:
Homo sapiens (Human)
Description:
P34969
Residue:
479
  
Inhibitor
Name:
BDBM50055521
Synonyms:
CHEMBL3321790
Type:
Small organic molecule
Emp. Form.:
C22H25ClFNOS
Mol. Mass.:
405.956
SMILES:
OC1(CC2CCC(C1)N2CCCSc1ccc(F)cc1)c1ccc(Cl)cc1
: