Target
D(2) dopamine receptor
Ligand
BDBM50055522
Substrate
Meas. Tech.
ChEMBL_1452244 (CHEMBL3366156)
Ki
27±n/a nM
Citation
 Sampson, DBricker, BZhu, XYPeprah, KLamango, NSSetola, VRoth, BLAblordeppey, SY Further evaluation of the tropane analogs of haloperidol. Bioorg Med Chem Lett 24:4294-7 (2014)  
Target
Name:
D(2) dopamine receptor
Synonyms:
D(2) dopamine receptor DOPAMINE D2 Long DRD2 Dopamine D2 receptor Dopamine D2 receptor (D2R) Dopamine2-like | d2
Type:
Cell-surface receptors
Mol. Mass.:
50647.10
Organism:
Homo sapiens (Human)
Description:
P14416
Residue:
443
  
Inhibitor
Name:
BDBM50055522
Synonyms:
CHEMBL3321791
Type:
Small organic molecule
Emp. Form.:
C22H25ClFNOS
Mol. Mass.:
405.956
SMILES:
OC1(CC2CCC(C1)N2CCCSc1cccc(F)c1)c1ccc(Cl)cc1
: