Target
D(1B) dopamine receptor
Ligand
BDBM50362867
Substrate
Meas. Tech.
ChEMBL_1452247 (CHEMBL3366159)
Ki
113±n/a nM
Citation
 Sampson, DBricker, BZhu, XYPeprah, KLamango, NSSetola, VRoth, BLAblordeppey, SY Further evaluation of the tropane analogs of haloperidol. Bioorg Med Chem Lett 24:4294-7 (2014)  
Target
Name:
D(1B) dopamine receptor
Synonyms:
D(5) dopamine receptor DOPAMINE D5 DRD1L2 DRD5_HUMAN | dopamine receptor D5
Type:
Protein
Mol. Mass.:
52943.41
Organism:
Homo sapiens (Human)
Description:
P21918
Residue:
477
  
Inhibitor
Name:
BDBM50362867
Synonyms:
CHEMBL1940403
Type:
Small organic molecule
Emp. Form.:
C20H23ClFNOS
Mol. Mass.:
379.919
SMILES:
OC1(CCN(CCCSc2ccc(F)cc2)CC1)c1ccc(Cl)cc1
: