Target
D(3) dopamine receptor
Ligand
BDBM50057761
Substrate
Meas. Tech.
ChEMBL_1450571 (CHEMBL3372149)
IC50
0.003800±n/a nM
Citation
 Ananthan, SSaini, SKZhou, GHobrath, JVPadmalayam, IZhai, LBostwick, JRAntonio, TReith, MEMcDowell, SCho, EMcAleer, LTaylor, MLuedtke, RR Design, synthesis, and structure-activity relationship studies of a series of [4-(4-carboxamidobutyl)]-1-arylpiperazines: insights into structural features contributing to dopamine D3 versus D2 receptor subtype selectivity. J Med Chem 57:7042-60 (2014)  
Target
Name:
D(3) dopamine receptor
Synonyms:
DOPAMINE D3 DRD3_HUMAN Dopamine D3 receptor (D3) Dopamine receptor Dopamine receptor D3
Type:
Mol. Mass.:
44243.43
Organism:
Homo sapiens (Human)
Description:
Residue:
400
  
Inhibitor
Name:
BDBM50057761
Synonyms:
CHEMBL3322994
Type:
Small organic molecule
Emp. Form.:
C22H25Cl2N5O
Mol. Mass.:
446.373
SMILES:
Clc1cccc(N2CCN(CCCCNC(=O)c3cn4ccccc4n3)CC2)c1Cl
: