Target
D(3) dopamine receptor
Ligand
BDBM50057772
Substrate
Meas. Tech.
ChEMBL_1449833 (CHEMBL3379903)
IC50
3.0±n/a nM
Citation
 Ananthan, SSaini, SKZhou, GHobrath, JVPadmalayam, IZhai, LBostwick, JRAntonio, TReith, MEMcDowell, SCho, EMcAleer, LTaylor, MLuedtke, RR Design, synthesis, and structure-activity relationship studies of a series of [4-(4-carboxamidobutyl)]-1-arylpiperazines: insights into structural features contributing to dopamine D3 versus D2 receptor subtype selectivity. J Med Chem 57:7042-60 (2014)  
Target
Name:
D(3) dopamine receptor
Synonyms:
DOPAMINE D3 DRD3_HUMAN Dopamine D3 receptor (D3) Dopamine receptor Dopamine receptor D3
Type:
Mol. Mass.:
44243.43
Organism:
Homo sapiens (Human)
Description:
Residue:
400
  
Inhibitor
Name:
BDBM50057772
Synonyms:
CHEMBL3322993
Type:
Small organic molecule
Emp. Form.:
C23H29N5O2
Mol. Mass.:
407.5087
SMILES:
COc1ccccc1N1CCN(CCCCNC(=O)c2cn3ccccc3n2)CC1
: