Target
Protein kinase C epsilon type
Ligand
BDBM50216860
Substrate
Meas. Tech.
ChEMBL_1460977 (CHEMBL3396876)
Ki
2.4±n/a nM
Citation
 Ann, JYoon, SBaek, JKim, da HLewin, NEHill, CSBlumberg, PMLee, J Design and synthesis of protein kinase C epsilon selective diacylglycerol lactones (DAG-lactones). Eur J Med Chem 90:332-41 (2015)  
Target
Name:
Protein kinase C epsilon type
Synonyms:
KPCE_HUMAN PKCE Protein kinase C epsilon Protein kinase C, PKC; classical/novel nPKC-epsilon
Type:
Enzyme
Mol. Mass.:
83680.45
Organism:
Homo sapiens (Human)
Description:
The recombinant human PKC enzymes were produced using a baculovirus expression system in SF9 cells
Residue:
737
  
Inhibitor
Name:
BDBM50216860
Synonyms:
CHEMBL230048 | Z-[2-(Hydroxymethyl)-4-(3-methylbutylidene)-5-oxo-2-(2,3-dihydrofuryl)]methyl 5-Methyl-3-(2-methylpropyl)hexanoate
Type:
Small organic molecule
Emp. Form.:
C22H38O5
Mol. Mass.:
382.5341
SMILES:
CC(C)C\C=C1\CC(CO)(COC(=O)CC(CC(C)C)CC(C)C)OC1=O
: