Target
Androgen receptor
Ligand
BDBM50068092
Substrate
Meas. Tech.
ChEMBL_1463777 (CHEMBL3404787)
IC50
>10000±n/a nM
Citation
 Aikawa, KMiyawaki, THitaka, TImai, YNHara, TMiyazaki, JYamaoka, MKusaka, MKanzaki, NTasaka, AShiraishi, MYamamoto, S Synthesis and biological evaluation of novel selective androgen receptor modulators (SARMs). Part I. Bioorg Med Chem 23:2568-78 (2015)  
Target
Name:
Androgen receptor
Synonyms:
ANDR_HUMAN Androgen Receptor Androgen receptor/Baculoviral IAP repeat-containing protein 2 Dihydrotestosterone receptor Nuclear receptor subfamily 3 group C member 4
Type:
Receptor
Mol. Mass.:
99185.27
Organism:
Homo sapiens (Human)
Description:
CHO cells were stably transfected with human AR gene.
Residue:
920
  
Inhibitor
Name:
BDBM50068092
Synonyms:
CHEMBL3402220
Type:
Small organic molecule
Emp. Form.:
C15H15NO2
Mol. Mass.:
241.2851
SMILES:
OC(=O)c1ccc(N2CCCC2)c2ccccc12
: