Target
Complement C3
Ligand
BDBM50070207
Substrate
Meas. Tech.
ChEMBL_1466995 (CHEMBL3411192)
IC50
4000±n/a nM
Citation
 Gorham, RDForest, DLKhoury, GASmadbeck, JBeecher, CNHealy, EDTamamis, PArchontis, GLarive, CKFloudas, CARadeke, MJJohnson, LVMorikis, D New compstatin peptides containing N-terminal extensions and non-natural amino acids exhibit potent complement inhibition and improved solubility characteristics. J Med Chem 58:814-26 (2015)  
Target
Name:
Complement C3
Synonyms:
C3 CPAMD1
Type:
Enzyme
Mol. Mass.:
187142.34
Organism:
Homo sapiens (Human)
Description:
P01024
Residue:
1663
  
Inhibitor
Name:
BDBM50070207
Synonyms:
CHEMBL3408038
Type:
Small organic molecule
Emp. Form.:
C82H108N22O18S2
Mol. Mass.:
1754.002
SMILES:
CC[C@H](C)[C@H](NC(C)=O)C(=O)N[C@H]1CSSC[C@H](NC(=O)[C@H](CCCNC(N)=N)NC(=O)[C@H](Cc2cnc[nH]2)NC(=O)[C@H](Cc2cccc3ccccc23)NC(=O)CNC(=O)[C@H](Cc2c[nH]c3ccccc23)NC(=O)[C@H](CC(O)=O)NC(=O)[C@H](CCC(N)=O)NC(=O)[C@H](Cc2cn(C)c3ccccc23)NC(=O)[C@@H](NC1=O)C(C)C)C(=O)N[C@@H]([C@@H](C)O)C(N)=O
: