Target
Nischarin
Ligand
BDBM50387823
Substrate
Meas. Tech.
ChEMBL_1467221 (CHEMBL3411418)
Ki
0.930000±n/a nM
Citation
 Gasparik, VGreney, HSchann, SFeldman, JFellmann, LEhrhardt, JDBousquet, P Synthesis and biological evaluation of 2-aryliminopyrrolidines as selective ligands for I1 imidazoline receptors: discovery of new sympatho-inhibitory hypotensive agents with potential beneficial effects in metabolic syndrome. J Med Chem 58:878-87 (2015)  
Target
Name:
Nischarin
Synonyms:
Imidazoline I1 Nisch | Nischarin
Type:
Enzyme Catalytic Domain
Mol. Mass.:
166460.59
Organism:
RAT
Description:
Q4G017
Residue:
1502
  
Inhibitor
Name:
BDBM50387823
Synonyms:
CHEMBL2058631
Type:
Small organic molecule
Emp. Form.:
C10H11Cl2N3
Mol. Mass.:
244.12
SMILES:
CC1CNC(N1)=Nc1c(Cl)cccc1Cl
: