Target
Nischarin
Ligand
BDBM50070372
Substrate
Meas. Tech.
ChEMBL_1467221 (CHEMBL3411418)
Ki
3.2±n/a nM
Citation
 Gasparik, VGreney, HSchann, SFeldman, JFellmann, LEhrhardt, JDBousquet, P Synthesis and biological evaluation of 2-aryliminopyrrolidines as selective ligands for I1 imidazoline receptors: discovery of new sympatho-inhibitory hypotensive agents with potential beneficial effects in metabolic syndrome. J Med Chem 58:878-87 (2015)  
Target
Name:
Nischarin
Synonyms:
Imidazoline I1 Nisch | Nischarin
Type:
Enzyme Catalytic Domain
Mol. Mass.:
166460.59
Organism:
RAT
Description:
Q4G017
Residue:
1502
  
Inhibitor
Name:
BDBM50070372
Synonyms:
CHEMBL3408291
Type:
Small organic molecule
Emp. Form.:
C12H16Cl2N2
Mol. Mass.:
259.175
SMILES:
Cl.CC1CN\C(C1)=N\c1cccc(Cl)c1C
: