Target
Kynurenine 3-monooxygenase
Ligand
BDBM50072080
Substrate
Meas. Tech.
ChEMBL_1467950 (CHEMBL3413307)
IC50
17±n/a nM
Citation
 Toledo-Sherman, LMPrime, MEMrzljak, LBeconi, MGBeresford, ABrookfield, FABrown, CJCardaun, ICourtney, SMDijkman, UHamelin-Flegg, EJohnson, PDKempf, VLyons, KMatthews, KMitchell, WLO'Connell, CPena, PPowell, KRassoulpour, AReed, LReindl, WSelvaratnam, SFriley, WWWeddell, DAWent, NEWheelan, PWinkler, CWinkler, DWityak, JYarnold, CJYates, DMunoz-Sanjuan, IDominguez, C Development of a series of aryl pyrimidine kynurenine monooxygenase inhibitors as potential therapeutic agents for the treatment of Huntington's disease. J Med Chem 58:1159-83 (2015)  
Target
Name:
Kynurenine 3-monooxygenase
Synonyms:
KMO_RAT | Kmo
Type:
PROTEIN
Mol. Mass.:
54371.88
Organism:
Rattus norvegicus
Description:
ChEMBL_1487468
Residue:
478
  
Inhibitor
Name:
BDBM50072080
Synonyms:
CHEMBL3407919
Type:
Small organic molecule
Emp. Form.:
C12H6ClF3N2O3
Mol. Mass.:
318.636
SMILES:
OC(=O)c1cc(ncn1)-c1ccc(OC(F)(F)F)c(Cl)c1
: