Target
Cannabinoid receptor 2
Ligand
BDBM50072356
Substrate
Meas. Tech.
ChEMBL_1469192 (CHEMBL3413748)
Ki
8.2±n/a nM
Citation
 Slavik, RHerde, AMBieri, DWeber, MSchibli, RKrämer, SDAmetamey, SMMu, L Synthesis, radiolabeling and evaluation of novel 4-oxo-quinoline derivatives as PET tracers for imaging cannabinoid type 2 receptor. Eur J Med Chem 92:554-64 (2015)  
Target
Name:
Cannabinoid receptor 2
Synonyms:
CANNABINOID CB2 CB2 CB2B CNR2_HUMAN Cannabinoid CB2 receptor Cannabinoid receptor 2 (CB2R) | hCB2
Type:
G Protein-Coupled Receptor (GPCR)
Mol. Mass.:
39690.94
Organism:
Homo sapiens (Human)
Description:
P34972
Residue:
360
  
Inhibitor
Name:
BDBM50072356
Synonyms:
CHEMBL3409150
Type:
Small organic molecule
Emp. Form.:
C19H26N2O3
Mol. Mass.:
330.4213
SMILES:
CCCCn1cc(C(=O)NC(C)(C)C)c(=O)c2cccc(OC)c12
: