Target
Cannabinoid receptor 2
Ligand
BDBM50350151
Substrate
Meas. Tech.
ChEMBL_1469192 (CHEMBL3413748)
Ki
1.7±n/a nM
Citation
 Slavik, RHerde, AMBieri, DWeber, MSchibli, RKrämer, SDAmetamey, SMMu, L Synthesis, radiolabeling and evaluation of novel 4-oxo-quinoline derivatives as PET tracers for imaging cannabinoid type 2 receptor. Eur J Med Chem 92:554-64 (2015)  
Target
Name:
Cannabinoid receptor 2
Synonyms:
CANNABINOID CB2 CB2 CB2B CNR2_HUMAN Cannabinoid CB2 receptor Cannabinoid receptor 2 (CB2R) | hCB2
Type:
G Protein-Coupled Receptor (GPCR)
Mol. Mass.:
39690.94
Organism:
Homo sapiens (Human)
Description:
P34972
Residue:
360
  
Inhibitor
Name:
BDBM50350151
Synonyms:
CHEMBL1814458
Type:
Small organic molecule
Emp. Form.:
C26H34N2O3
Mol. Mass.:
422.5598
SMILES:
CCCCCn1cc(C(=O)NC23CC4CC(CC(C4)C2)C3)c(=O)c2cccc(OC)c12
: