Target
Cannabinoid receptor 2
Ligand
BDBM50072349
Substrate
Meas. Tech.
ChEMBL_1469198 (CHEMBL3413754)
Ki
3.9±n/a nM
Citation
 Slavik, RHerde, AMBieri, DWeber, MSchibli, RKrämer, SDAmetamey, SMMu, L Synthesis, radiolabeling and evaluation of novel 4-oxo-quinoline derivatives as PET tracers for imaging cannabinoid type 2 receptor. Eur J Med Chem 92:554-64 (2015)  
Target
Name:
Cannabinoid receptor 2
Synonyms:
CANNABINOID CB2 CB2 CB2B CNR2_HUMAN Cannabinoid CB2 receptor Cannabinoid receptor 2 (CB2R) | hCB2
Type:
G Protein-Coupled Receptor (GPCR)
Mol. Mass.:
39690.94
Organism:
Homo sapiens (Human)
Description:
P34972
Residue:
360
  
Inhibitor
Name:
BDBM50072349
Synonyms:
CHEMBL3409322
Type:
Small organic molecule
Emp. Form.:
C23H24Cl2N2O3
Mol. Mass.:
447.354
SMILES:
COc1ccc2n(C(=O)c3ccc(Cl)cc3Cl)c(C)c(CCN3CCOCC3)c2c1
: