Target
Nitric oxide synthase, brain
Ligand
BDBM50255365
Substrate
Meas. Tech.
ChEMBL_1469607 (CHEMBL3412864)
Ki
5.0±n/a nM
Citation
 Annedi, SC Cell-permeable inhibitors of neuronal nitric oxide synthase open new prospects for the treatment of neurological disorders. J Med Chem 58:1064-6 (2015)  
Target
Name:
Nitric oxide synthase, brain
Synonyms:
Bnos NC-NOS NOS type I nNOS Neuronal nitric oxide synthase Nitric Oxide Synthase, brain Nitric oxide synthase, brain (nNOS) Nitric-oxide synthase, brain (nNOS) Nos1 | Peptidyl-cysteine S-nitrosylase NOS1
Type:
Enzyme
Mol. Mass.:
160570.98
Organism:
Rattus norvegicus (rat)
Description:
Recombinant nNOS overexpressed in E. coli was used in enzyme assays.
Residue:
1429
  
Inhibitor
Name:
BDBM50255365
Synonyms:
(+/-)-cis-N1-((3S,4S)-4-((6-amino-4-methylpyridin-2-yl)methyl)pyrrolidin-3-yl)-N2-(3-fluorophenethyl)ethane-1,2-diamine CHEMBL480419 N1-{(+/-)-4''-[(6''''-amino-4''''-methylpyridin-2''''-yl)methyl]pyrrolidin-3-yl}-N2-(3''-fluorophenethyl)ethane-1,2-diamine
Type:
Small organic molecule
Emp. Form.:
C21H30FN5
Mol. Mass.:
371.4948
SMILES:
Cc1cc(N)nc(C[C@H]2CNC[C@H]2NCCNCCc2cccc(F)c2)c1
: