Target
Falcipain 2
Ligand
BDBM50074130
Substrate
Meas. Tech.
ChEMBL_1468093 (CHEMBL3413866)
Ki
600±n/a nM
Citation
 Chakka, SKKalamuddin, MSundararaman, SWei, LMundra, SMahesh, RMalhotra, PMohmmed, AKotra, LP Identification of novel class of falcipain-2 inhibitors as potential antimalarial agents. Bioorg Med Chem 23:2221-40 (2015)  
Target
Name:
Falcipain 2
Synonyms:
Cysteine protease falcipain-2 Falcipain-2
Type:
Enzyme
Mol. Mass.:
55912.60
Organism:
Plasmodium falciparum
Description:
Recombinant falcipain-2.
Residue:
484
  
Inhibitor
Name:
BDBM50074130
Synonyms:
CHEMBL3409915
Type:
Small organic molecule
Emp. Form.:
C32H41N5O5
Mol. Mass.:
575.6984
SMILES:
CC(C)C[C@H](NC(=O)[C@H](CC(C)C)NC(=O)c1ccco1)C(=O)N[C@@H](Cc1ccccc1)C(=O)NNc1ccccc1
: