Target
Histone acetyltransferase GCN5
Ligand
BDBM47033
Substrate
Meas. Tech.
ChEMBL_1473889 (CHEMBL3419140)
IC50
12000±n/a nM
Citation
 Dahlin, JLNissink, JWStrasser, JMFrancis, SHiggins, LZhou, HZhang, ZWalters, MA PAINS in the assay: chemical mechanisms of assay interference and promiscuous enzymatic inhibition observed during a sulfhydryl-scavenging HTS. J Med Chem 58:2091-113 (2015)  
Target
Name:
Histone acetyltransferase GCN5
Synonyms:
ADA4 GCN5 Histone acetyltransferase GCN5 | SWI9
Type:
PROTEIN
Mol. Mass.:
51069.24
Organism:
Saccharomyces cerevisiae S288c
Description:
ChEMBL_100832
Residue:
439
  
Inhibitor
Name:
BDBM47033
Synonyms:
(2,3-diphenyl-1,2,4-thiadiazol-2-ium-5-yl)-phenyl-amine;hydrobromide N,2,3-triphenyl-1,2,4-thiadiazol-2-ium-5-amine;hydrobromide | cid_25181254
Type:
Small organic molecule
Emp. Form.:
C20H16N3S
Mol. Mass.:
330.426
SMILES:
N(c1nc(-c2ccccc2)[n+](s1)-c1ccccc1)c1ccccc1
: