Target
Arachidonate 5-lipoxygenase-activating protein
Ligand
BDBM50078119
Substrate
Meas. Tech.
ChEMBL_1471933 (CHEMBL3420848)
IC50
4800±n/a nM
Citation
 Takahashi, HRiether, DBartolozzi, ABosanac, TBerger, VBinetti, RBroadwater, JChen, ZCrux, RDe Lombaert, SDave, RDines, JAFadra-Khan, TFlegg, AGarrigou, MHao, MHHuber, JHutzler, JMKerr, SKotey, ALiu, WLo, HYLoke, PLMahaney, PEMorwick, TMNapier, SOlague, APack, EPadyana, AKThomson, DSTye, HWu, LZindell, RMAbeywardane, ASimpson, T Synthesis, SAR, and series evolution of novel oxadiazole-containing 5-lipoxygenase activating protein inhibitors: discovery of 2-[4-(3-{(r)-1-[4-(2-amino-pyrimidin-5-yl)-phenyl]-1-cyclopropyl-ethyl}-[1,2,4]oxadiazol-5-yl)-pyrazol-1-yl]-N,N-dimethyl-acetamide (BI 665915). J Med Chem 58:1669-90 (2015)  
Target
Name:
Arachidonate 5-lipoxygenase-activating protein
Synonyms:
AL5AP_MOUSE Arachidonate 5-lipoxygenase-activating protein MK-886-binding protein
Type:
PROTEIN
Mol. Mass.:
18139.94
Organism:
Mus musculus
Description:
ChEMBL_109591
Residue:
161
  
Inhibitor
Name:
BDBM50078119
Synonyms:
CHEMBL3417525
Type:
Small organic molecule
Emp. Form.:
C24H26N8O2
Mol. Mass.:
458.5156
SMILES:
CN(C)C(=O)Cn1cc(cn1)-c1nc(no1)[C@](C)(C1CC1)c1ccc(cc1)-c1cnc(N)nc1
: