Target
Adenosine receptor A2a
Ligand
BDBM50078423
Substrate
Meas. Tech.
ChEMBL_1471049 (CHEMBL3420494)
EC50
3.8±n/a nM
Citation
 Petrelli, RTorquati, IKachler, SLuongo, LMaione, SFranchetti, PGrifantini, MNovellino, ELavecchia, AKlotz, KNCappellacci, L 5'-C-Ethyl-tetrazolyl-N(6)-substituted adenosine and 2-chloro-adenosine derivatives as highly potent dual acting A1 adenosine receptor agonists and A3 adenosine receptor antagonists. J Med Chem 58:2560-6 (2015)  
Target
Name:
Adenosine receptor A2a
Synonyms:
A2A adenosine receptor (hA2A) ADENOSINE A2 ADORA2 Adenosine A2A receptor (A2AAR)
Type:
G Protein-Coupled Receptor (GPCR)
Mol. Mass.:
44716.46
Organism:
Homo sapiens (Human)
Description:
P29274
Residue:
412
  
Inhibitor
Name:
BDBM50078423
Synonyms:
CHEMBL3414937
Type:
Small organic molecule
Emp. Form.:
C12H14ClN9O3
Mol. Mass.:
367.751
SMILES:
CCn1nnc(n1)[C@H]1O[C@H]([C@H](O)[C@@H]1O)n1cnc2c(N)nc(Cl)nc12
: