Target
Cell division protein FtsZ
Ligand
BDBM50010058
Substrate
Meas. Tech.
ChEMBL_1470485 (CHEMBL3419202)
Kd
16600±n/a nM
Citation
 Li, XMa, S Advances in the discovery of novel antimicrobials targeting the assembly of bacterial cell division protein FtsZ. Eur J Med Chem 95:1-15 (2015)  
Target
Name:
Cell division protein FtsZ
Synonyms:
FTSZ_ECOLI sfiB | sulB
Type:
Protein
Mol. Mass.:
40305.83
Organism:
Escherichia coli
Description:
P0A9A6
Residue:
383
  
Inhibitor
Name:
BDBM50010058
Synonyms:
CHEBI:51231 | DAPI
Type:
Small organic molecule
Emp. Form.:
C16H15N5
Mol. Mass.:
277.3238
SMILES:
NC(=N)c1ccc(cc1)-c1cc2ccc(cc2[nH]1)C(N)=N
: