Target
Dual specificity tyrosine-phosphorylation-regulated kinase 1B
Ligand
BDBM50081186
Substrate
Meas. Tech.
ChEMBL_1475745 (CHEMBL3424978)
IC50
2.0±n/a nM
Citation
 Kettle, JGBallard, PBardelle, CCockerill, MColclough, NCritchlow, SEDebreczeni, JFairley, GFillery, SGraham, MAGoodwin, LGuichard, SHudson, KWard, RAWhittaker, D Discovery and optimization of a novel series of Dyrk1B kinase inhibitors to explore a MEK resistance hypothesis. J Med Chem 58:2834-44 (2015)  
Target
Name:
Dual specificity tyrosine-phosphorylation-regulated kinase 1B
Synonyms:
DYR1B_HUMAN Dual specificity tyrosine-phosphorylation-regulated kinase 1B MIRK
Type:
Enzyme
Mol. Mass.:
69222.24
Organism:
Homo sapiens (Human)
Description:
Q9Y463
Residue:
629
  
Inhibitor
Name:
BDBM50081186
Synonyms:
CHEMBL3421962
Type:
Small organic molecule
Emp. Form.:
C22H23N7
Mol. Mass.:
385.4649
SMILES:
CN1CCN(CC1)c1ccc(Nc2cc(ncn2)-c2c[nH]c3cnccc23)cc1
: