Target
Tyrosyl-DNA phosphodiesterase 1
Ligand
BDBM50388544
Substrate
Meas. Tech.
ChEMBL_1474545 (CHEMBL3423834)
IC50
1000±n/a nM
Citation
 Nguyen, TXAbdelmalak, MMarchand, CAgama, KPommier, YCushman, M Synthesis and biological evaluation of nitrated 7-, 8-, 9-, and 10-hydroxyindenoisoquinolines as potential dual topoisomerase I (Top1)-tyrosyl-DNA phosphodiesterase I (TDP1) inhibitors. J Med Chem 58:3188-208 (2015)  
Target
Name:
Tyrosyl-DNA phosphodiesterase 1
Synonyms:
TDP1 Tyrosyl-DNA phosphodiesterase 1 | Tyrosyl-DNA phosphodiesterase 1 (TDP1)
Type:
Enzyme
Mol. Mass.:
68430.66
Organism:
Homo sapiens (Human)
Description:
Q9NUW8
Residue:
608
  
Inhibitor
Name:
BDBM50388544
Synonyms:
CHEMBL2057323
Type:
Small organic molecule
Emp. Form.:
C41H36N4O4
Mol. Mass.:
648.7489
SMILES:
O=C1c2ccccc2-c2c1c1ccccc1c(=O)n2CCCNCCCNCCCn1c2-c3ccccc3C(=O)c2c2ccccc2c1=O
: