Target
Voltage-dependent L-type calcium channel subunit alpha-1C
Ligand
BDBM50017723
Substrate
Meas. Tech.
ChEMBL_1479144 (CHEMBL3436120)
IC50
1240±n/a nM
Citation
 Wisniowska, BMendyk, AFijorek, KGlinka, APolak, S Predictive model for L-type channel inhibition: multichannel block in QT prolongation risk assessment. J Appl Toxicol 32:858-66 (2012)  
Target
Name:
Voltage-dependent L-type calcium channel subunit alpha-1C
Synonyms:
CAC1C_CAVPO CACH2 CACNA1C CCHL1A1 Voltage-dependent L-type calcium channel subunit alpha-1C | Voltage-gated calcium channel subunit alpha Cav1.2
Type:
PROTEIN
Mol. Mass.:
19518.62
Organism:
Cavia porcellus
Description:
ChEMBL_106600
Residue:
169
  
Inhibitor
Name:
BDBM50017723
Synonyms:
(3,3-Diphenyl-propyl)-(1-methyl-2-phenyl-ethyl)-amine Prenylamine | Prenylamine(3,3-Diphenyl-propyl)-(1-methyl-2-phenyl-ethyl)-amine
Type:
Small organic molecule
Emp. Form.:
C24H27N
Mol. Mass.:
329.4779
SMILES:
CC(Cc1ccccc1)NCCC(c1ccccc1)c1ccccc1
: