Target
Solute carrier organic anion transporter family member 1B1
Ligand
BDBM50088504
Substrate
Meas. Tech.
ChEMBL_1487742 (CHEMBL3533736)
IC50
5000±n/a nM
Citation
 Soars, MGBarton, PIsmair, MJupp, RRiley, RJ The development, characterization, and application of an OATP1B1 inhibition assay in drug discovery. Drug Metab Dispos 40:1641-8 (2012)  
Target
Name:
Solute carrier organic anion transporter family member 1B1
Synonyms:
LST1 OATP2 SLC21A6 SO1B1_HUMAN Solute carrier organic anion transporter family member 1B1 (OATP1B1) | Thromboxane B2
Type:
Protein
Mol. Mass.:
76468.06
Organism:
Homo sapiens (Human)
Description:
Q9Y6L6
Residue:
691
  
Inhibitor
Name:
BDBM50088504
Synonyms:
A-84538 CHEBI:45409 Ritonavir
Type:
Small organic molecule
Emp. Form.:
C37H48N6O5S2
Mol. Mass.:
720.944
SMILES:
CC(C)[C@H](NC(=O)N(C)Cc1csc(n1)C(C)C)C(=O)N[C@H](C[C@H](O)[C@H](Cc1ccccc1)NC(=O)OCc1cncs1)Cc1ccccc1
: