Target
Beta-hexosaminidase subunit alpha
Ligand
BDBM18780
Substrate
Meas. Tech.
ChEMBL_1496352 (CHEMBL3579956)
IC50
18000±n/a nM
Citation
 Tropak, MBZhang, JYonekawa, SRigat, BAAulakh, VSSmith, MRHwang, HJCiufolini, MAMahuran, DJ Pyrimethamine Derivatives: Insight into Binding Mechanism and Improved Enhancement of Mutantß-N-acetylhexosaminidase Activity. J Med Chem 58:4483-93 (2015)  
Target
Name:
Beta-hexosaminidase subunit alpha
Synonyms:
Beta-N-acetylhexosaminidase subunit alpha HEXA | HEXA_HUMAN
Type:
Protein
Mol. Mass.:
60688.46
Organism:
Homo sapiens (Human)
Description:
P06865
Residue:
529
  
Inhibitor
Name:
BDBM18780
Synonyms:
6-ethyl-5-(4-methoxyphenyl)pyrimidine-2,4-diamine P18
Type:
Small organic molecule
Emp. Form.:
C13H16N4O
Mol. Mass.:
244.2923
SMILES:
CCc1nc(N)nc(N)c1-c1ccc(OC)cc1
: