Target
Alpha-1B adrenergic receptor
Ligand
BDBM50091350
Substrate
Meas. Tech.
ChEMBL_1497771 (CHEMBL3583291)
Ki
0.100000±n/a nM
Citation
 Zhang, WMa, ZLi, WLi, GChen, LLiu, ZDu, LLi, M Discovery of Quinazoline-Based Fluorescent Probes toa1-Adrenergic Receptors. ACS Med Chem Lett 6:502-6 (2015)  
Target
Name:
Alpha-1B adrenergic receptor
Synonyms:
ADA1B_HUMAN Adrenergic alpha1B Adrenergic receptor alpha Alpha 1B-adrenoreceptor | Alpha-1B adrenergic receptor
Type:
Enzyme
Mol. Mass.:
56862.13
Organism:
Homo sapiens (Human)
Description:
P35368
Residue:
520
  
Inhibitor
Name:
BDBM50091350
Synonyms:
CHEMBL3582270
Type:
Small organic molecule
Emp. Form.:
C30H33N9O5
Mol. Mass.:
599.6403
SMILES:
CCN(CC)c1ccc2cc(-n3cc(nn3)C(=O)N3CCN(CC3)c3nc(N)c4cc(OC)c(OC)cc4n3)c(=O)oc2c1
: