Target
Acetylcholinesterase
Ligand
BDBM50092532
Substrate
Meas. Tech.
ChEMBL_1500860 (CHEMBL3588424)
IC50
1690±n/a nM
Citation
 Nguyen, VTTo, DCTran, MHOh, SHKim, JAAli, MYWoo, MHChoi, JSMin, BS Isolation of cholinesterase andß-secretase 1 inhibiting compounds from Lycopodiella cernua. Bioorg Med Chem 23:3126-34 (2015)  
Target
Name:
Acetylcholinesterase
Synonyms:
ACES_HUMAN Acetylcholinesterase (AChE) | Acetylcholinesterase (human AChE)
Type:
Enzyme
Mol. Mass.:
67792.70
Organism:
Homo sapiens (Human)
Description:
P22303
Residue:
614
  
Inhibitor
Name:
BDBM50092532
Synonyms:
CHEMBL3586200
Type:
Small organic molecule
Emp. Form.:
C39H56O7
Mol. Mass.:
636.8577
SMILES:
[H][C@@]12CC=C3C[C@]4(C)CC[C@]5([H])[C@](C)(CC[C@H](OC(=O)CCc6ccc(O)cc6)[C@]5(C)C(O)=O)[C@@]4([H])CC[C@]3([H])[C@@]1(C)CC[C@@H](O)[C@]2(C)CO
: