Target
Dual specificity protein kinase CLK1
Ligand
BDBM50097862
Substrate
Meas. Tech.
ChEMBL_1502245 (CHEMBL3591181)
IC50
100±n/a nM
Citation
 Falke, HChaikuad, ABecker, ALoaëc, NLozach, OAbu Jhaisha, SBecker, WJones, PGPreu, LBaumann, KKnapp, SMeijer, LKunick, C 10-iodo-11H-indolo[3,2-c]quinoline-6-carboxylic acids are selective inhibitors of DYRK1A. J Med Chem 58:3131-43 (2015)  
Target
Name:
Dual specificity protein kinase CLK1
Synonyms:
CDC-like kinase 1 Clk Protein kinase STY | Sty
Type:
PROTEIN
Mol. Mass.:
57124.52
Organism:
Mus musculus
Description:
ChEMBL_1502245
Residue:
483
  
Inhibitor
Name:
BDBM50097862
Synonyms:
CHEMBL3589673
Type:
Small organic molecule
Emp. Form.:
C17H11ClN2O3
Mol. Mass.:
326.734
SMILES:
COc1ccc2nc(C(O)=O)c3c4cccc(Cl)c4[nH]c3c2c1
: