Target
Dual specificity protein kinase CLK1
Ligand
BDBM50097863
Substrate
Meas. Tech.
ChEMBL_1502245 (CHEMBL3591181)
IC50
220±n/a nM
Citation
 Falke, HChaikuad, ABecker, ALoaëc, NLozach, OAbu Jhaisha, SBecker, WJones, PGPreu, LBaumann, KKnapp, SMeijer, LKunick, C 10-iodo-11H-indolo[3,2-c]quinoline-6-carboxylic acids are selective inhibitors of DYRK1A. J Med Chem 58:3131-43 (2015)  
Target
Name:
Dual specificity protein kinase CLK1
Synonyms:
CDC-like kinase 1 Clk Protein kinase STY | Sty
Type:
PROTEIN
Mol. Mass.:
57124.52
Organism:
Mus musculus
Description:
ChEMBL_1502245
Residue:
483
  
Inhibitor
Name:
BDBM50097863
Synonyms:
CHEMBL3589674
Type:
Small organic molecule
Emp. Form.:
C23H15ClN2O3
Mol. Mass.:
402.83
SMILES:
COc1cccc(c1)-c1ccc2nc(C(O)=O)c3c4cccc(Cl)c4[nH]c3c2c1
: