Target
Dual specificity protein kinase CLK2
Ligand
BDBM50097855
Substrate
Meas. Tech.
ChEMBL_1502246 (CHEMBL3591182)
IC50
110±n/a nM
Citation
 Falke, HChaikuad, ABecker, ALoaëc, NLozach, OAbu Jhaisha, SBecker, WJones, PGPreu, LBaumann, KKnapp, SMeijer, LKunick, C 10-iodo-11H-indolo[3,2-c]quinoline-6-carboxylic acids are selective inhibitors of DYRK1A. J Med Chem 58:3131-43 (2015)  
Target
Name:
Dual specificity protein kinase CLK2
Synonyms:
CDC-like kinase 2 Clk2
Type:
PROTEIN
Mol. Mass.:
60021.57
Organism:
Mus musculus
Description:
ChEMBL_1502246
Residue:
499
  
Inhibitor
Name:
BDBM50097855
Synonyms:
CHEMBL3589666
Type:
Small organic molecule
Emp. Form.:
C17H11BrN2O3
Mol. Mass.:
371.185
SMILES:
COc1ccc2c3[nH]c4c(Br)cccc4c3c(nc2c1)C(O)=O
: