Target
Dual specificity protein kinase CLK4
Ligand
BDBM50097868
Substrate
Meas. Tech.
ChEMBL_1502248 (CHEMBL3591184)
IC50
35±n/a nM
Citation
 Falke, HChaikuad, ABecker, ALoaëc, NLozach, OAbu Jhaisha, SBecker, WJones, PGPreu, LBaumann, KKnapp, SMeijer, LKunick, C 10-iodo-11H-indolo[3,2-c]quinoline-6-carboxylic acids are selective inhibitors of DYRK1A. J Med Chem 58:3131-43 (2015)  
Target
Name:
Dual specificity protein kinase CLK4
Synonyms:
CDC-like kinase 4 Clk4
Type:
PROTEIN
Mol. Mass.:
57374.39
Organism:
Mus musculus
Description:
ChEMBL_1502248
Residue:
481
  
Inhibitor
Name:
BDBM50097868
Synonyms:
CHEMBL3589661
Type:
Small organic molecule
Emp. Form.:
C16H9BrN2O2
Mol. Mass.:
341.159
SMILES:
OC(=O)c1nc2ccccc2c2[nH]c3c(Br)cccc3c12
: