Target
Dual specificity tyrosine-phosphorylation-regulated kinase 2
Ligand
BDBM50097867
Substrate
Meas. Tech.
ChEMBL_1502250 (CHEMBL3591329)
IC50
40±n/a nM
Citation
 Falke, HChaikuad, ABecker, ALoaëc, NLozach, OAbu Jhaisha, SBecker, WJones, PGPreu, LBaumann, KKnapp, SMeijer, LKunick, C 10-iodo-11H-indolo[3,2-c]quinoline-6-carboxylic acids are selective inhibitors of DYRK1A. J Med Chem 58:3131-43 (2015)  
Target
Name:
Dual specificity tyrosine-phosphorylation-regulated kinase 2
Synonyms:
DYRK2 Dual-specificity tyrosine-phosphorylation regulated kinase 2
Type:
PROTEIN
Mol. Mass.:
66690.69
Organism:
Homo sapiens (Human)
Description:
ChEMBL_1508025
Residue:
601
  
Inhibitor
Name:
BDBM50097867
Synonyms:
CHEMBL3589660
Type:
Small organic molecule
Emp. Form.:
C16H9ClN2O2
Mol. Mass.:
296.708
SMILES:
OC(=O)c1nc2ccccc2c2[nH]c3c(Cl)cccc3c12
: