Target
Dual specificity tyrosine-phosphorylation-regulated kinase 1A
Ligand
BDBM50097856
Substrate
Meas. Tech.
ChEMBL_1502241 (CHEMBL3591177)
IC50
22±n/a nM
Citation
 Falke, HChaikuad, ABecker, ALoaëc, NLozach, OAbu Jhaisha, SBecker, WJones, PGPreu, LBaumann, KKnapp, SMeijer, LKunick, C 10-iodo-11H-indolo[3,2-c]quinoline-6-carboxylic acids are selective inhibitors of DYRK1A. J Med Chem 58:3131-43 (2015)  
Target
Name:
Dual specificity tyrosine-phosphorylation-regulated kinase 1A
Synonyms:
DYR1A_HUMAN DYRK1A Dual specificity YAK1-related kinase 1A (Dyrk1A) Dual-specificity tyrosine-phosphorylation regulated kinase 1A HP86 MNBH
Type:
Enzyme
Mol. Mass.:
85616.61
Organism:
Homo sapiens (Human)
Description:
Q13627
Residue:
763
  
Inhibitor
Name:
BDBM50097856
Synonyms:
CHEMBL3589667
Type:
Small organic molecule
Emp. Form.:
C17H11IN2O3
Mol. Mass.:
418.1853
SMILES:
COc1ccc2c3[nH]c4c(I)cccc4c3c(nc2c1)C(O)=O
: