Target
Dual specificity tyrosine-phosphorylation-regulated kinase 1A
Ligand
BDBM50097860
Substrate
Meas. Tech.
ChEMBL_1502241 (CHEMBL3591177)
IC50
180±n/a nM
Citation
 Falke, HChaikuad, ABecker, ALoaëc, NLozach, OAbu Jhaisha, SBecker, WJones, PGPreu, LBaumann, KKnapp, SMeijer, LKunick, C 10-iodo-11H-indolo[3,2-c]quinoline-6-carboxylic acids are selective inhibitors of DYRK1A. J Med Chem 58:3131-43 (2015)  
Target
Name:
Dual specificity tyrosine-phosphorylation-regulated kinase 1A
Synonyms:
DYR1A_HUMAN DYRK1A Dual specificity YAK1-related kinase 1A (Dyrk1A) Dual-specificity tyrosine-phosphorylation regulated kinase 1A HP86 MNBH
Type:
Enzyme
Mol. Mass.:
85616.61
Organism:
Homo sapiens (Human)
Description:
Q13627
Residue:
763
  
Inhibitor
Name:
BDBM50097860
Synonyms:
CHEMBL3589671
Type:
Small organic molecule
Emp. Form.:
C16H8ClIN2O2
Mol. Mass.:
422.604
SMILES:
OC(=O)c1nc2ccc(I)cc2c2[nH]c3c(Cl)cccc3c12
: