Target
Monoglyceride lipase
Ligand
BDBM50099618
Substrate
Meas. Tech.
ChEMBL_1432385 (CHEMBL3384490)
IC50
0.900000±n/a nM
Citation
 Korhonen, JKuusisto, Avan Bruchem, JPatel, JZLaitinen, TNavia-Paldanius, DLaitinen, JTSavinainen, JRParkkari, TNevalainen, TJ Piperazine and piperidine carboxamides and carbamates as inhibitors of fatty acid amide hydrolase (FAAH) and monoacylglycerol lipase (MAGL). Bioorg Med Chem 22:6694-705 (2014)  
Target
Name:
Monoglyceride lipase
Synonyms:
HU-K5 Lysophospholipase-like MGL MGLL_HUMAN
Type:
Hydrolase
Mol. Mass.:
33264.56
Organism:
Homo sapiens (Human)
Description:
Human recombinant MGL (Cayman Chemical, cat# 10008354).
Residue:
303
  
Inhibitor
Name:
BDBM50099618
Synonyms:
CHEMBL1232635
Type:
Small organic molecule
Emp. Form.:
C20H19F2N5O
Mol. Mass.:
383.3946
SMILES:
Fc1ccc(cc1)C(N1CCN(CC1)C(=O)n1cncn1)c1ccc(F)cc1
: