Target
DNA gyrase subunit B
Ligand
BDBM50366824
Substrate
Meas. Tech.
ChEMBL_1456851 (CHEMBL3367584)
IC50
>50000±n/a nM
Citation
 Renuka, JReddy, KISrihari, KJeankumar, VUShravan, MSridevi, JPYogeeswari, PBabu, KSSriram, D Design, synthesis, biological evaluation of substituted benzofurans as DNA gyraseB inhibitors of Mycobacterium tuberculosis. Bioorg Med Chem 22:4924-34 (2014)  
Target
Name:
DNA gyrase subunit B
Synonyms:
GYRB_MYCSM | gyrB
Type:
PROTEIN
Mol. Mass.:
74505.25
Organism:
Mycobacterium smegmatis
Description:
ChEMBL_107961
Residue:
675
  
Inhibitor
Name:
BDBM50366824
Synonyms:
Avelox Moxifl-oxacin
Type:
Small organic molecule
Emp. Form.:
C21H24FN3O4
Mol. Mass.:
401.4314
SMILES:
COc1c(N2C[C@@H]3CCCN[C@@H]3C2)c(F)cc2c1n(cc(C(O)=O)c2=O)C1CC1
: