Target
Glucocorticoid receptor
Ligand
BDBM50110734
Substrate
Meas. Tech.
ChEMBL_1510388 (CHEMBL3607228)
IC50
143±n/a nM
Citation
 Luz, JGCarson, MWCondon, BClawson, DPustilnik, AKohlman, DTBarr, RJBean, JSDill, MJSindelar, DKMaletic, MCoghlan, MJ Indole Glucocorticoid Receptor Antagonists Active in a Model of Dyslipidemia Act via a Unique Association with an Agonist Binding Site. J Med Chem 58:6607-18 (2015)  
Target
Name:
Glucocorticoid receptor
Synonyms:
GCR_HUMAN GRL Glucocorticoid receptor (GRFP) Nuclear receptor subfamily 3 group C member 1
Type:
Enzyme
Mol. Mass.:
85656.87
Organism:
Homo sapiens (Human)
Description:
P04150
Residue:
777
  
Inhibitor
Name:
BDBM50110734
Synonyms:
CHEMBL3605930
Type:
Small organic molecule
Emp. Form.:
C16H15ClN2O3S
Mol. Mass.:
350.82
SMILES:
COc1ccc(Cl)cc1-c1c[nH]c2c(NS(C)(=O)=O)cccc12
: