Target
Glucocorticoid receptor
Ligand
BDBM50110734
Substrate
Meas. Tech.
ChEMBL_1510389 (CHEMBL3607229)
IC50
1250±n/a nM
Citation
 Luz, JGCarson, MWCondon, BClawson, DPustilnik, AKohlman, DTBarr, RJBean, JSDill, MJSindelar, DKMaletic, MCoghlan, MJ Indole Glucocorticoid Receptor Antagonists Active in a Model of Dyslipidemia Act via a Unique Association with an Agonist Binding Site. J Med Chem 58:6607-18 (2015)  
Target
Name:
Glucocorticoid receptor
Synonyms:
GCR_RAT Glucocorticoid Receptor (GR) Grl | Nr3c1
Type:
Enzyme Catalytic Domain
Mol. Mass.:
87556.83
Organism:
RAT
Description:
Glucocorticoid 0 RAT::P06536
Residue:
795
  
Inhibitor
Name:
BDBM50110734
Synonyms:
CHEMBL3605930
Type:
Small organic molecule
Emp. Form.:
C16H15ClN2O3S
Mol. Mass.:
350.82
SMILES:
COc1ccc(Cl)cc1-c1c[nH]c2c(NS(C)(=O)=O)cccc12
: