Target
cAMP-dependent protein kinase catalytic subunit alpha
Ligand
BDBM138348
Substrate
Meas. Tech.
ChEMBL_1510761 (CHEMBL3606456)
IC50
>10000±n/a nM
Citation
 Papeo, GPosteri, HBorghi, DBusel, AACaprera, FCasale, ECiomei, MCirla, ACorti, ED'Anello, MFasolini, MForte, BGalvani, AIsacchi, AKhvat, AKrasavin, MYLupi, ROrsini, PPerego, RPesenti, EPezzetta, DRainoldi, SRiccardi-Sirtori, FScolaro, ASola, FZuccotto, FFelder, ERDonati, DMontagnoli, A Discovery of 2-[1-(4,4-Difluorocyclohexyl)piperidin-4-yl]-6-fluoro-3-oxo-2,3-dihydro-1H-isoindole-4-carboxamide (NMS-P118): A Potent, Orally Available, and Highly Selective PARP-1 Inhibitor for Cancer Therapy. J Med Chem 58:6875-98 (2015)  
Target
Name:
cAMP-dependent protein kinase catalytic subunit alpha
Synonyms:
KAPCA_HUMAN PKACA cAMP-dependent protein kinase (PKA) cAMP-dependent protein kinase catalytic subunit alpha cAMP-dependent protein kinase catalytic subunit alpha (PKACA) cAMP-dependent protein kinase catalytic subunit alpha isoform 1 | cAMP-dependent protein kinase, alpha-catalytic subunit
Type:
Enzyme Catalytic Subunit
Mol. Mass.:
40598.73
Organism:
Homo sapiens (Human)
Description:
Residue:
351
  
Inhibitor
Name:
BDBM138348
Synonyms:
US8877944, 99
Type:
Small organic molecule
Emp. Form.:
C20H24F3N3O2
Mol. Mass.:
395.4187
SMILES:
NC(=O)c1cc(F)cc2CN(C3CCN(CC3)C3CCC(F)(F)CC3)C(=O)c12
: