Target
Serine/threonine-protein kinase PAK 4
Ligand
BDBM138348
Substrate
Meas. Tech.
ChEMBL_1510635 (CHEMBL3608086)
IC50
>10000±n/a nM
Citation
 Papeo, GPosteri, HBorghi, DBusel, AACaprera, FCasale, ECiomei, MCirla, ACorti, ED'Anello, MFasolini, MForte, BGalvani, AIsacchi, AKhvat, AKrasavin, MYLupi, ROrsini, PPerego, RPesenti, EPezzetta, DRainoldi, SRiccardi-Sirtori, FScolaro, ASola, FZuccotto, FFelder, ERDonati, DMontagnoli, A Discovery of 2-[1-(4,4-Difluorocyclohexyl)piperidin-4-yl]-6-fluoro-3-oxo-2,3-dihydro-1H-isoindole-4-carboxamide (NMS-P118): A Potent, Orally Available, and Highly Selective PARP-1 Inhibitor for Cancer Therapy. J Med Chem 58:6875-98 (2015)  
Target
Name:
Serine/threonine-protein kinase PAK 4
Synonyms:
KIAA1142 PAK4_HUMAN | p21-Activated kinase 4 (PAK4)
Type:
Protein
Mol. Mass.:
64098.01
Organism:
Homo sapiens (Human)
Description:
O96013
Residue:
591
  
Inhibitor
Name:
BDBM138348
Synonyms:
US8877944, 99
Type:
Small organic molecule
Emp. Form.:
C20H24F3N3O2
Mol. Mass.:
395.4187
SMILES:
NC(=O)c1cc(F)cc2CN(C3CCN(CC3)C3CCC(F)(F)CC3)C(=O)c12
: